{"text_format":"1","workbook":"xlsx","n_sheets":13,"sheets":["Introduction DORA","Overall results","Task Manager ","ICT Risk Management","ICT-related incident management","Testing","Sheet6","Third Party Risk Mangement","Questionnaire","Do not Touch","Tasks","Sheet2","Sheet7"],"not_rendered":{"charts":0,"images":0,"macros":1,"external_links":0,"defined_names":7,"comments":5,"pivot_tables":0},"unopened":[],"bounds":{"document_bytes":16777216,"sheet_cells":100000,"rows_first":2000,"rows_last":500,"rows_between":2000,"halvings":0,"cell_chars":16384,"cell_head_chars":4096},"cells_cut":0,"cells_raw":0,"read":"whole","date_system":"1900"}

{"sheet":"Introduction DORA","index":0,"n_rows":15,"n_cols":6,"rows_kept":15,"cut":false,"hidden":false,"merged":[[1,4,2,5]]}
[]
[null,null,null,null,"Set a description for each effort and priority level to ensure that the organization understand the level which they work with throughout the document"]
[]
[null,null,null,null,"Effort Level ","Description"]
[null,null,null,null,"Low "]
[null,null,null,null,"Medium "]
[null,null,null,null,"High"]
[]
{"$rows_left_out":8}
{"sheet":"Overall results","index":1,"n_rows":13,"n_cols":12,"rows_kept":13,"cut":false,"hidden":false,"merged":[]}
[]
[]
[]
[]
[]
[]
[]
[]
{"$rows_left_out":6}
{"sheet":"Task Manager ","index":2,"n_rows":44,"n_cols":10,"rows_kept":44,"cut":false,"hidden":false,"merged":[[2,2,2,9]]}
[]
[]
[null,null,"Tasks to meet DORA requirments"]
[]
[]
[null,null,"Question \n\"The drop-down-list contains all questions from the Overall results table meaning all questions answered with either \"no\" or \"partly\"","Do you meet the requirements today?","Percentage done ","Priority","Effort Level","Task ","Responsible ","Due date"]
[null,null,null,{"$f":"+IFERROR(VLOOKUP(Table11[[#This Row],[Question \n\"The drop-down-list contains all questions from the Overall results table meaning all questions answered with either \"no\" or \"partly\"]],'Overall results'!$C$14:$L$142,6,FALSE),\"\")","v":""},{"$f":"+IFERROR(VLOOKUP(Table11[[#This Row],[Question \n\"The drop-down-list contains all questions from the Overall results table meaning all questions answered with either \"no\" or \"partly\"]],'Overall results'!$C$14:$L$142,7,FALSE),\"\")","v":""},{"$f":"IFERROR(VLOOKUP(Table11[[#This Row],[Question \n\"The drop-down-list contains all questions from the Overall results table meaning all questions answered with either \"no\" or \"partly\"]],'Overall results'!$C$14:$L$142,8,FALSE),\"\")","v":""},{"$f":"+IFERROR(VLOOKUP(Table11[[#This Row],[Question \n\"The drop-down-list contains all questions from the Overall results table meaning all questions answered with either \"no\" or \"partly\"]],'Overall results'!$C$14:$L$142,9,FALSE),\"\")","v":""}]
[null,null,null,{"$f":"+IFERROR(VLOOKUP(Table11[[#This Row],[Question \n\"The drop-down-list contains all questions from the Overall results table meaning all questions answered with either \"no\" or \"partly\"]],'Overall results'!$C$14:$L$142,6,FALSE),\"\")","v":""},{"$f":"+IFERROR(VLOOKUP(Table11[[#This Row],[Question \n\"The drop-down-list contains all questions from the Overall results table meaning all questions answered with either \"no\" or \"partly\"]],'Overall results'!$C$14:$L$142,7,FALSE),\"\")","v":""},{"$f":"IFERROR(VLOOKUP(Table11[[#This Row],[Question \n\"The drop-down-list contains all questions from the Overall results table meaning all questions answered with either \"no\" or \"partly\"]],'Overall results'!$C$14:$L$142,8,FALSE),\"\")","v":""},{"$f":"+IFERROR(VLOOKUP(Table11[[#This Row],[Question \n\"The drop-down-list contains all questions from the Overall results table meaning all questions answered with either \"no\" or \"partly\"]],'Overall results'!$C$14:$L$142,9,FALSE),\"\")","v":""}]
{"$rows_left_out":37}
{"sheet":"ICT Risk Management","index":3,"n_rows":97,"n_cols":12,"rows_kept":97,"cut":false,"hidden":false,"merged":[]}
[]
[]
[null,null,null,null,null,"You can use the filter box to find specific sections by using phrases like \"Business Continuity\" or \"Cyber Security\""]
[null,"Topic ","Question","Article  ","Section","DORA Text \n(subset of DORA text in relation to the question) ","Requirements for specific companies ","Do you meet the requirements today?","% requirements meet","Priority","Effort level \n(How much effort will it take to implement) ","Comments/Tasks "]
[null,"ICT Risk management ","Does your organization have an internal governance and control framework in place to ensure effective and prudent management of ICT risk?",5,1,"Financial entities shall have in place an internal governance and control framework that \nensures an effective and prudent management of ICT risk, in accordance with Article 6(4), \nin order to achieve a high level of digital operational resilience."," "]
[null,"ICT Risk management ","Does your management body define, oversee and take responsibility for the ICT risk management framework?",5,2,"The management body of the financial entity shall define, approve, oversee and be \nresponsible for the implementation of all arrangements related to the ICT risk management \nframework referred to in Article 6(1)."]
[null,"ICT Risk management ","Does your management body bear the ultimate responsibility for managing the organization's ICT risk?",5,2,"(a) bear the ultimate responsibility for managing the financial entity’s ICT risk;"]
[null,"ICT Risk management ","Does your organization maintain policies to ensure high standards of data availability, authenticity, integrity, and confidentiality?",5,2,"(b) put in place policies that aim to ensure the maintenance of high standards of \navailability, authenticity, integrity and confidentiality, of data;"]
{"$rows_left_out":90}
{"sheet":"ICT-related incident management","index":4,"n_rows":24,"n_cols":12,"rows_kept":24,"cut":false,"hidden":false,"merged":[]}
[]
[]
[]
[null,null,null,null,null,"You can use the filter box to find specific sections by using phrases like \"Business Continuity\" or \"Cyber Security\""]
[null,"Topic ","Question","Article  ","Section","DORA Text \n(subset of DORA text in relation to the question) ","Requirements for specific companies ","Do you meet the requirements today?","% requirements meet","Priority","Effort level \n(How much effort will it take to implement) ","Comments/Tasks "]
[null,"ICT-related incident management, classification and reporting","Does the organization define, establish and implement an incident management process for ICT-related incidents to detect, manage, and notify them?",17,1,"Financial entities shall define, establish and implement an ICT-related incident \nmanagement process to detect, manage and notify ICT-related incidents."]
[null,"ICT-related incident management, classification and reporting","Does the organization record all ICT-related incidents and significant cyber threats?",17,2,"Financial entities shall record all ICT-related incidents and significant cyber threats. \nFinancial entities shall establish appropriate procedures and processes to ensure a \nconsistent and integrated monitoring, handling and follow-up of ICT-related incidents, to ensure that root causes are identified, documented and addressed in order to prevent the occurrence of such incidents."]
[null,"ICT-related incident management, classification and reporting","Has the organization established appropriate procedures and processes to ensure consistent and integrated monitoring, handling and follow-up of ICT-related incidents?",17,2,"Financial entities shall record all ICT-related incidents and significant cyber threats. \nFinancial entities shall establish appropriate procedures and processes to ensure a \nconsistent and integrated monitoring, handling and follow-up of ICT-related incidents, to ensure that root causes are identified, documented and addressed in order to prevent the occurrence of such incidents."]
{"$rows_left_out":17}
{"sheet":"Testing","index":5,"n_rows":16,"n_cols":12,"rows_kept":16,"cut":false,"hidden":false,"merged":[]}
[]
[]
[]
[]
[]
[]
[null,null,null,null,null,"You can use the filter box to find specific sections by using phrases like \"Business Continuity\" or \"Cyber Security\""]
[null,"Topic ","Question","Article  ","Section","DORA Text \n(subset of DORA text in relation to the question) ","Requirements for specific companies ","Do you meet the requirements today?","% requirements meet","Priority","Effort level \n(How much effort will it take to implement) ","Comments/Tasks "]
{"$rows_left_out":9}
{"sheet":"Sheet6","index":6,"n_rows":47,"n_cols":9,"rows_kept":47,"cut":false,"hidden":true,"merged":[]}
["Topic ","Question","Article  ","Section","DORA Text ","Do you meet the requirements today?","% requirements meet","Priority","Comments/Tasks "]
["Third Party Risk Management","Does the organization manage ICT third party Risk as an integrated part of the overall ICT risk management framework? ",28,1,"1. Financial entities shall manage ICT third-party risk as an integral component of ICT risk \nwithin their ICT risk management framework as referred to in Article 6(1), and in \naccordance with the following principles:","Partly",null,1]
["Third Party Risk Management","Is the organization acting as responsible for all service providers running business operations?",28,1,"(a) financial entities that have in place contractual arrangements for the use of ICT \nservices to run their business operations shall, at all times, remain fully responsible \nfor compliance with, and the discharge of, all obligations under this Regulation and \napplicable financial services law;","Partly",null,3]
["Third Party Risk Management","Is ICT third party risk implemented in light of the principle of proportionality taking into account the nature, scale, complexity and importance of ICT related dependencies",28,1,"financial entities’ management of ICT third-party risk shall be implemented in light \nof the principle of proportionality, taking into account:\n(i) the nature, scale, complexity and importance of ICT-related dependencies,\n(ii) the risks arising from contractual arrangements on the use of ICT services \nconcluded with ICT third-party service providers, taking into account the \ncriticality or importance of the respective service, process or function, and the \npotential impact on the continuity and availability of financial services and \nactivities, at individual and at group level","No",null,3]
["Third Party Risk Management","Is ICT third party risk implemented in light of the principle of proportionality taking into account the risks arising from contractual arrangements on the use of ICT services done by ICT third party service providers especially with regards to Criticality or importance service, process or function. with regard to the continuity and availbility of financial services and activities ",28,1,"financial entities’ management of ICT third-party risk shall be implemented in light \nof the principle of proportionality, taking into account:\n(i) the nature, scale, complexity and importance of ICT-related dependencies,\n(ii) the risks arising from contractual arrangements on the use of ICT services \nconcluded with ICT third-party service providers, taking into account the \ncriticality or importance of the respective service, process or function, and the \npotential impact on the continuity and availability of financial services and \nactivities, at individual and at group level"]
["Third Party Risk Management","As part of the ICT Risk management organizations should maintain and update a data base related to all contractual arrangements on the use of the ICT services provided by ICT third party ",28,1,"As part of their ICT risk management framework, financial entities shall maintain and \nupdate at entity level, and at sub-consolidated and consolidated levels, a register of \ninformation in relation to all contractual arrangements on the use of ICT services provided \nby ICT third-party service providers."]
["Third Party Risk Management","Has the organization  adapted and yearly reviewed a strategy on ICT third-party risk taking into account a multi-vendor strategy? ",28,2,"2. As part of their ICT risk management framework, financial entities, other than entities \nreferred to in Article 16(1), first subparagraph, and other than microenterprises, shall \nadopt, and regularly review, a strategy on ICT third-party risk, taking into account the \nmulti-vendor strategy referred to in Article 6(9), where applicable. The strategy on ICT \nthird-party risk shall include a policy on the use of ICT services supporting critical or \nimportant functions provided by ICT third-party service providers and shall apply on an \nindividual basis and, where relevant, on a sub-consolidated and consolidated basis. The \nmanagement body shall, on the basis of an assessment of the overall risk profile of the \nfinancial entity and the scale and complexity of the business services, regularly review the \nrisks identified in respect to contractual arrangements on the use of ICT services \nsupporting critical or important functions."]
["Third Party Risk Management","Does the above mentioned strategy provide a policy for vendors serving  critical or important functions? ",28,2,"2. As part of their ICT risk management framework, financial entities, other than entities \nreferred to in Article 16(1), first subparagraph, and other than microenterprises, shall \nadopt, and regularly review, a strategy on ICT third-party risk, taking into account the \nmulti-vendor strategy referred to in Article 6(9), where applicable. The strategy on ICT \nthird-party risk shall include a policy on the use of ICT services supporting critical or \nimportant functions provided by ICT third-party service providers and shall apply on an \nindividual basis and, where relevant, on a sub-consolidated and consolidated basis. The \nmanagement body shall, on the basis of an assessment of the overall risk profile of the \nfinancial entity and the scale and complexity of the business services, regularly review the \nrisks identified in respect to contractual arrangements on the use of ICT services \nsupporting critical or important functions."]
{"$rows_left_out":40}
{"sheet":"Third Party Risk Mangement","index":7,"n_rows":48,"n_cols":12,"rows_kept":48,"cut":false,"hidden":false,"merged":[]}
[0]
[]
[]
[null,null,null,null,null,"You can use the filter box to find specific sections by using phrases like \"Business Continuity\" or \"Cyber Security\""]
[null,"Topic ","Question","Article  ","Section","DORA Text \n(subset of DORA text in relation to the question) ","Requirements for specific companies ","Do you meet the requirements today?","% requirements meet","Priority","Effort level \n(How much effort will it take to implement) ","Comments/Tasks "]
[null,"Third Party Risk Management","Does the organization manage ICT third party risk as an integrated part of the overall ICT risk management framework?",28,1,"1. Financial entities shall manage ICT third-party risk as an integral component of ICT risk \nwithin their ICT risk management framework as referred to in Article 6(1), and in \naccordance with the following principles:"]
[null,"Third Party Risk Management","Is the organization acting as responsible for all service providers running business operations?",28,1,"(a) financial entities that have in place contractual arrangements for the use of ICT \nservices to run their business operations shall, at all times, remain fully responsible \nfor compliance with, and the discharge of, all obligations under this Regulation and \napplicable financial services law;"]
[null,"Third Party Risk Management","Is ICT third party risk implemented in light of the principle of proportionality taking into account the nature, scale, complexity and importance of ICT-related dependencies?",28,1,"financial entities’ management of ICT third-party risk shall be implemented in light \nof the principle of proportionality, taking into account:\n(i) the nature, scale, complexity and importance of ICT-related dependencies,\n(ii) the risks arising from contractual arrangements on the use of ICT services \nconcluded with ICT third-party service providers, taking into account the \ncriticality or importance of the respective service, process or function, and the \npotential impact on the continuity and availability of financial services and \nactivities, at individual and at group level"]
{"$rows_left_out":41}
{"sheet":"Questionnaire","index":8,"n_rows":114,"n_cols":8,"rows_kept":114,"cut":false,"hidden":true,"merged":[]}
[]
[]
[null,null,"Key Area ","ICT Risk management ",null,"Kontoller som är delvist/inte uppfyllnad"]
[null,null,"Ja",{"$f":"+COUNTIF(#REF!,Sheet2!$B$3)","v":{"$error":"#REF!"}},null,{"$f":"Tasks!$B11","v":"Information-sharing arrangements on cyber threat information and intelligence"}]
[null,null,"Delvist ",{"$f":"+COUNTIF(#REF!,Sheet2!$B$4)","v":{"$error":"#REF!"}},null,{"$f":"Tasks!$B12","v":"ICT Risk management Framework is established"}]
[null,null,"Nej",{"$f":"+COUNTIF(#REF!,Sheet2!$B$5)","v":{"$error":"#REF!"}},null,{"$f":"Tasks!$B13","v":"IT tools and systems to minize ICT Risk "}]
[null,null,"Key Area ","ICT Incident Reporting and management ",null,{"$f":"Tasks!$B14","v":"Business continuity plans for all processes involving "}]
[null,null,"Ja",{"$f":"+COUNTIF(#REF!,Sheet2!$B$3)","v":{"$error":"#REF!"}},null,{"$f":"Tasks!$B15","v":"Disaster Recovery plans for all Critical and Important systems "}]
{"$rows_left_out":107}
{"sheet":"Do not Touch","index":9,"n_rows":3,"n_cols":61,"rows_kept":3,"cut":false,"hidden":false,"merged":[]}
["Topic ","Question","Article  ","Section","DORA Text \n(subset of DORA text in relation to the question) ","Requirements for specific companies ","Do you meet the requirements today?","% requirements meet","Priority","Effort level \n(How much effort will it take to implement) ","Comments/Tasks ",null,null,null,null,"Topic ","Question","Article  ","Section","DORA Text \n(subset of DORA text in relation to the question) ","Requirements for specific companies ","Do you meet the requirements today?","% requirements meet","Priority","Effort level \n(How much effort will it take to implement) ","Comments/Tasks ",null,null,"Topic ","Question","Article  ","Section","DORA Text \n(subset of DORA text in relation to the question) ","Requirements for specific companies ","Do you meet the requirements today?","% requirements meet","Priority","Effort level \n(How much effort will it take to implement) ","Comments/Tasks ",null,null,null,null,null,null,null,null,null,null,null,"Topic ","Question","Article  ","Section","DORA Text \n(subset of DORA text in relation to the question) ","Requirements for specific companies ","Do you meet the requirements today?","% requirements meet","Priority","Effort level \n(How much effort will it take to implement) ","Comments/Tasks "]
["ICT Risk management ","Does your organization have an internal governance and control framework in place to ensure effective and prudent management of ICT risk?",5,1,"Financial entities shall have in place an internal governance and control framework that \nensures an effective and prudent management of ICT risk, in accordance with Article 6(4), \nin order to achieve a high level of digital operational resilience."," ","Partly",null,3,"High Effort ",null,null,null,null,null,"ICT-related incident management, classification and reporting","Does the organization define, establish and implement an incident management process for ICT-related incidents to detect, manage, and notify them?",17,1,"Financial entities shall define, establish and implement an ICT-related incident \nmanagement process to detect, manage and notify ICT-related incidents.",null,"Partly",null,4,null,null,null,null,"Digital operational resilience testing","Does your organization establish, maintain and review a sound and comprehensive digital operational resilience testing program as an integral part of the ICT risk-management framework referred to in Article 6?",24,1,"For the purpose of assessing preparedness for handling ICT-related incidents, of identifying weaknesses, deficiencies and gaps in digital operational resilience, and of promptly implementing corrective measures, financial entities, other than microenterprises, shall, taking into account the criteria set out in Article 4(2), establish, maintain and review a sound and comprehensive digital operational resilience testing programme as an integral part of the ICT risk-management framework referred to in Article 6.","other than microenterprises","Partly",null,3,"Low effort ",null,null,null,null,null,null,null,null,null,null,null,null,"Third Party Risk Management","Does the organization manage ICT third party risk as an integrated part of the overall ICT risk management framework?",28,1,"1. Financial entities shall manage ICT third-party risk as an integral component of ICT risk \nwithin their ICT risk management framework as referred to in Article 6(1), and in \naccordance with the following principles:",null,"Partly",null,null,"Medium Effort "]
["ICT Risk management ","Does your management body define, oversee and take responsibility for the ICT risk management framework?",5,2,"The management body of the financial entity shall define, approve, oversee and be \nresponsible for the implementation of all arrangements related to the ICT risk management \nframework referred to in Article 6(1).",null,"No",null,4,null,null,null,null,null,null,"ICT-related incident management, classification and reporting","Does the organization record all ICT-related incidents and significant cyber threats?",17,2,"Financial entities shall record all ICT-related incidents and significant cyber threats. \nFinancial entities shall establish appropriate procedures and processes to ensure a \nconsistent and integrated monitoring, handling and follow-up of ICT-related incidents, to ensure that root causes are identified, documented and addressed in order to prevent the occurrence of such incidents.",null,"No",null,null,null,null,null,null,"Digital operational resilience testing","Does the organization's program include a range of assessments, tests, methodologies, practices and tools to be applied in accordance with Articles 25 and 26?",24,2,"The digital operational resilience testing programme shall include a range of assessments, tests, methodologies, practices and tools to be applied in accordance with Articles 25 and 26.",null,"No",null,null,null,null,null,null,null,null,null,null,null,null,null,null,null,"Third Party Risk Management","Is the organization acting as responsible for all service providers running business operations?",28,1,"(a) financial entities that have in place contractual arrangements for the use of ICT \nservices to run their business operations shall, at all times, remain fully responsible \nfor compliance with, and the discharge of, all obligations under this Regulation and \napplicable financial services law;",null,"No"]

{"sheet":"Tasks","index":10,"n_rows":22,"n_cols":7,"rows_kept":22,"cut":false,"hidden":true,"merged":[]}
[]
[]
[]
[]
[]
[]
[]
[]
{"$rows_left_out":15}
{"sheet":"Sheet2","index":11,"n_rows":7,"n_cols":6,"rows_kept":7,"cut":false,"hidden":true,"merged":[]}
[]
[]
[null,"Yes",null,1,null,"Low effort "]
[null,"Partly",null,2,null,"Medium Effort "]
[null,"No",null,3,null,"High Effort "]
[null,null,null,4]
[null,null,null,5]

{"sheet":"Sheet7","index":12,"n_rows":267,"n_cols":10,"rows_kept":267,"cut":false,"hidden":true,"merged":[]}
[]
[]
[]
[null,"Topic ","Question","Article  ","Section","DORA Text ","Do you meet the requirements today?","% requirements meet","Priority","Comments/Tasks "]
[null,"ICT Risk management ","Does your financial entity have in place an internal governance and control framework that ensures an effective and prudent management of ICT risk",5,1,"Financial entities shall have in place an internal governance and control framework that \nensures an effective and prudent management of ICT risk, in accordance with Article 6(4), \nin order to achieve a high level of digital operational resilience.","Partly",0.9,4]
[null,"ICT Risk management ","Does your management body define, oversee and take responsibility for the ICT risk management framwork? ",5,2,"The management body of the financial entity shall define, approve, oversee and be \nresponsible for the implementation of all arrangements related to the ICT risk management \nframework referred to in Article 6(1).","Partly",0.75,1]
[null,"ICT Risk management ","Bear the ultimate responsibility for managing the organizations ICT risk ",5,2,"(a) bear the ultimate responsibility for managing the financial entity’s ICT risk;","Yes",1,3]
[null,"ICT Risk management ","Maintain policies to in sure high standards of availability, authenticity, integrity, and confidentiality of data",5,2,"(b) put in place policies that aim to ensure the maintenance of high standards of \navailability, authenticity, integrity and confidentiality, of data;","No",0.5,1]
{"$rows_left_out":259}